Target
Polyphenol oxidase 2
Ligand
BDBM50121848
Substrate
Meas. Tech.
ChEMBL_1516667 (CHEMBL3620447)
IC50
20250±n/a nM
Citation
 Radhakrishnan, SShimmon, RConn, CBaker, A Integrated kinetic studies and computational analysis on naphthyl chalcones as mushroom tyrosinase inhibitors. Bioorg Med Chem Lett 25:4085-91 (2015)  
Target
Name:
Polyphenol oxidase 2
Synonyms:
Monophenol monooxygenase PPO2 Tyrosinase
Type:
Protein
Mol. Mass.:
63923.66
Organism:
Agaricus bisporus (Common mushroom)
Description:
O42713
Residue:
556
  
Inhibitor
Name:
BDBM50121848
Synonyms:
CHEMBL3617038
Type:
Small organic molecule
Emp. Form.:
C18H14N2O2
Mol. Mass.:
290.316
SMILES:
O\N=C(/C=C/c1ccccn1)\c1cc2ccccc2cc1O
: