Target
Glucose-dependent insulinotropic receptor
Ligand
BDBM50122756
Substrate
Meas. Tech.
ChEMBL_1520112 (CHEMBL3625576)
EC50
1.1±n/a nM
Citation
 Liu, PHu, ZDuBois, BGMoyes, CRHunter, DNZhu, CKar, NFZhu, YGarfunkle, JKang, LChicchi, GEhrhardt, AWoods, ASeo, TWoods, Mvan Heek, MDingley, KHPang, JSalituro, GMPowell, JTerebetski, JLHornak, VCampeau, LCLamberson, JUjjainwalla, FMiller, MStamford, AWood, HBKowalski, TNargund, RPEdmondson, SD Design of Potent and Orally Active GPR119 Agonists for the Treatment of Type II Diabetes. ACS Med Chem Lett 6:936-41 (2015)  
Target
Name:
Glucose-dependent insulinotropic receptor
Synonyms:
G-protein coupled receptor 119 (GPR119) GPR119 | Glucose-dependent insulinotropic receptor
Type:
Protein
Mol. Mass.:
36901.49
Organism:
Homo sapiens (Human)
Description:
Q8TDV5
Residue:
335
  
Inhibitor
Name:
BDBM50122756
Synonyms:
CHEMBL3622179
Type:
Small organic molecule
Emp. Form.:
C23H28FN7O2
Mol. Mass.:
453.5125
SMILES:
COCc1cnc(nc1)N1CCC(CC1)[C@H]1C[C@H]1COCc1ccc(c(F)c1)-n1cnnn1
: