Target
Glucose-dependent insulinotropic receptor
Ligand
BDBM50122936
Substrate
Meas. Tech.
ChEMBL_1520112 (CHEMBL3625576)
EC50
1.7±n/a nM
Citation
 Liu, PHu, ZDuBois, BGMoyes, CRHunter, DNZhu, CKar, NFZhu, YGarfunkle, JKang, LChicchi, GEhrhardt, AWoods, ASeo, TWoods, Mvan Heek, MDingley, KHPang, JSalituro, GMPowell, JTerebetski, JLHornak, VCampeau, LCLamberson, JUjjainwalla, FMiller, MStamford, AWood, HBKowalski, TNargund, RPEdmondson, SD Design of Potent and Orally Active GPR119 Agonists for the Treatment of Type II Diabetes. ACS Med Chem Lett 6:936-41 (2015)  
Target
Name:
Glucose-dependent insulinotropic receptor
Synonyms:
G-protein coupled receptor 119 (GPR119) GPR119 | Glucose-dependent insulinotropic receptor
Type:
Protein
Mol. Mass.:
36901.49
Organism:
Homo sapiens (Human)
Description:
Q8TDV5
Residue:
335
  
Inhibitor
Name:
BDBM50122936
Synonyms:
CHEMBL3622181
Type:
Small organic molecule
Emp. Form.:
C23H32FN3O4S
Mol. Mass.:
465.581
SMILES:
CCS(=O)(=O)c1ccc(OCC[C@@H]2C[C@@H]2C2CCN(CC2)c2nc(no2)C(C)C)c(F)c1
: