Target
Tyrosine-protein kinase SYK
Ligand
BDBM50123570
Substrate
Meas. Tech.
ChEMBL_1521566 (CHEMBL3627444)
IC50
9.0±n/a nM
Citation
 Thoma, GVeenstra, SStrang, RBlanz, JVangrevelinghe, EBerghausen, JLee, CCZerwes, HG Orally bioavailable Syk inhibitors with activity in a rat PK/PD model. Bioorg Med Chem Lett 25:4642-7 (2015)  
Target
Name:
Tyrosine-protein kinase SYK
Synonyms:
KSYK_HUMAN Spleen Tyrosine Kinase Tyrosine-protein kinase SYK (Syk)
Type:
Enzyme
Mol. Mass.:
72079.99
Organism:
Homo sapiens (Human)
Description:
P43405
Residue:
635
  
Inhibitor
Name:
BDBM50123570
Synonyms:
CHEMBL3622698
Type:
Small organic molecule
Emp. Form.:
C16H14F2N4O3S
Mol. Mass.:
380.369
SMILES:
[H][C@@]1(CNC(=O)O1)[C@@H](C)Oc1cc(cc2ncsc12)-c1cnn(c1)C(F)F
: