Target
Estrogen receptor
Ligand
BDBM50041611
Substrate
Meas. Tech.
ChEMBL_1519262 (CHEMBL3624759)
IC50
1288±n/a nM
Citation
 De Savi, CBradbury, RHRabow, AANorman, RAde Almeida, CAndrews, DMBallard, PButtar, DCallis, RJCurrie, GSCurwen, JODavies, CDDonald, CSFeron, LJGingell, HGlossop, SCHayter, BRHussain, SKaroutchi, GLamont, SGMacFaul, PMoss, TAPearson, SETonge, MWalker, GEWeir, HMWilson, Z Optimization of a Novel Binding Motif to (E)-3-(3,5-Difluoro-4-((1R,3R)-2-(2-fluoro-2-methylpropyl)-3-methyl-2,3,4,9-tetrahydro-1H-pyrido[3,4-b]indol-1-yl)phenyl)acrylic Acid (AZD9496), a Potent and Orally Bioavailable Selective Estrogen Receptor Downregulator and Antagonist. J Med Chem 58:8128-40 (2015)  
Target
Name:
Estrogen receptor
Synonyms:
ER ESR ESR1_HUMAN Estrogen receptor Estrogen receptor (ER-alpha) Estrogen receptor alpha (ER) Nuclear receptor subfamily 3 group A member 1
Type:
Protein
Mol. Mass.:
66230.44
Organism:
Homo sapiens (Human)
Description:
P03372
Residue:
595
  
Inhibitor
Name:
BDBM50041611
Synonyms:
(2E)-3-{4-[(1E)-1,2-DIPHENYLBUT-1-ENYL]PHENYL}ACRYLIC ACID CHEMBL33899
Type:
Small organic molecule
Emp. Form.:
C25H22O2
Mol. Mass.:
354.441
SMILES:
CC\C(=C(/c1ccccc1)c1ccc(\C=C\C(O)=O)cc1)c1ccccc1
: