Target
Coagulation factor IX
Ligand
BDBM50125980
Substrate
Meas. Tech.
ChEMBL_1522950 (CHEMBL3630982)
Ki
3.3±n/a nM
Citation
 Zhang, TAndre, PBateman, TJChen, YHDesai, KEllsworth, KGeissler, WMGuo, LHruza, AJian, TMeng, DParker, DLQian, XReichert, PSherer, ECShu, MSmith, CJSonatore, LMTschirret-Guth, RNolting, AFOrr, RCampeau, LCAraki, KNishimura, TSakurada, IWood, HB Development of a novel class of potent and selective FIXa inhibitors. Bioorg Med Chem Lett 25:4945-9 (2015)  
Target
Name:
Coagulation factor IX
Synonyms:
Christmas factor Coagulation factor IX/VIII Coagulation factor IXa heavy chain F9 Factor IX Factor IXa (fIXa) Plasma thromboplastin component
Type:
Enzyme
Mol. Mass.:
51768.83
Organism:
Homo sapiens (Human)
Description:
P00740
Residue:
461
  
Inhibitor
Name:
BDBM50125980
Synonyms:
CHEMBL3627900
Type:
Small organic molecule
Emp. Form.:
C28H21Cl2F2N5O2
Mol. Mass.:
568.401
SMILES:
Cc1ncn(n1)-c1cc(Cl)c(C(=O)NC[C@@H](c2cccc(F)c2)c2cc(=O)c3c(C)ccc(F)c3[nH]2)c(Cl)c1
: