Target
Folate receptor beta
Ligand
BDBM50126175
Substrate
Meas. Tech.
ChEMBL_1523804 (CHEMBL3632255)
IC50
>1000±n/a nM
Citation
 Wang, LWallace, ARaghavan, SDeis, SMWilson, MRYang, SPolin, LWhite, KKushner, JOrr, SGeorge, CO'Connor, CHou, ZMitchell-Ryan, SDann, CEMatherly, LHGangjee, A 6-Substituted Pyrrolo[2,3-d]pyrimidine Thienoyl Regioisomers as Targeted Antifolates for Folate Receptora and the Proton-Coupled Folate Transporter in Human Tumors. J Med Chem 58:6938-59 (2015)  
Target
Name:
Folate receptor beta
Synonyms:
FBP FOLR2_HUMAN Folate receptor 2 Folate receptor, fetal/placental | Placental folate-binding protein
Type:
PROTEIN
Mol. Mass.:
29286.32
Organism:
Homo sapiens (Human)
Description:
ChEMBL_20077
Residue:
255
  
Inhibitor
Name:
BDBM50126175
Synonyms:
CHEMBL3628347
Type:
Small organic molecule
Emp. Form.:
C19H21N5O6S
Mol. Mass.:
447.465
SMILES:
Nc1nc(N)c2c(CCCc3cc(cs3)C(=O)N[C@@H](CCC(O)=O)C(O)=O)coc2n1
: