Target
Trifunctional purine biosynthetic protein adenosine-3
Ligand
BDBM50126175
Substrate
Meas. Tech.
ChEMBL_1523832 (CHEMBL3632393)
IC50
101±n/a nM
Citation
 Wang, LWallace, ARaghavan, SDeis, SMWilson, MRYang, SPolin, LWhite, KKushner, JOrr, SGeorge, CO'Connor, CHou, ZMitchell-Ryan, SDann, CEMatherly, LHGangjee, A 6-Substituted Pyrrolo[2,3-d]pyrimidine Thienoyl Regioisomers as Targeted Antifolates for Folate Receptora and the Proton-Coupled Folate Transporter in Human Tumors. J Med Chem 58:6938-59 (2015)  
Target
Name:
Trifunctional purine biosynthetic protein adenosine-3
Synonyms:
GAR Tfase GART Glycinamide ribonucleotide transformylase (GAR Tfase) PRGS Thymidylate synthase/GAR transformylase/AICAR transformylase
Type:
Protein
Mol. Mass.:
107768.47
Organism:
Homo sapiens (Human)
Description:
P22102
Residue:
1010
  
Inhibitor
Name:
BDBM50126175
Synonyms:
CHEMBL3628347
Type:
Small organic molecule
Emp. Form.:
C19H21N5O6S
Mol. Mass.:
447.465
SMILES:
Nc1nc(N)c2c(CCCc3cc(cs3)C(=O)N[C@@H](CCC(O)=O)C(O)=O)coc2n1
: