Target
Coagulation factor X
Ligand
BDBM50126855
Substrate
Meas. Tech.
ChEMBL_1524005 (CHEMBL3630477)
Ki
397±n/a nM
Citation
 Meng, DAndre, PBateman, TJBerger, RChen, YHDesai, KDewnani, SEllsworth, KFeng, DGeissler, WMGuo, LHruza, AJian, TLi, HMetzger, JParker, DLReichert, PSherer, ECSmith, CJSonatore, LMTschirret-Guth, RWu, JXu, JZhang, TCampeau, LCOrr, RPoirier, MMcCabe-Dunn, JAraki, KNishimura, TSakurada, IHirabayashi, TWood, HB Development of a novel tricyclic class of potent and selective FIXa inhibitors. Bioorg Med Chem Lett 25:5437-43 (2015)  
Target
Name:
Coagulation factor X
Synonyms:
Activated coagulation factor X (FXa) Coagulation factor X precursor F10 Factor X heavy chain Factor Xa Stuart-Prower factor
Type:
Enzyme
Mol. Mass.:
54726.60
Organism:
Homo sapiens (Human)
Description:
Residue:
488
  
Inhibitor
Name:
BDBM50126855
Synonyms:
CHEMBL3628962 | US10351558, Example 173
Type:
Small organic molecule
Emp. Form.:
C29H24Cl2N6O2
Mol. Mass.:
559.446
SMILES:
Cc1ccc2n3C[C@@](CCc3c(\C=N\O)c2c1)(NC(=O)c1c(Cl)cc(cc1Cl)-n1cnnc1)c1ccccc1
: