Target
Carbonic anhydrase 7
Ligand
BDBM50049400
Substrate
Meas. Tech.
ChEBML_1523543
Temperature
298.15±n/a K
Ki
493±n/a nM
Comments
extracted
Citation
 Karioti, ACeruso, MCarta, FBilia, ARSupuran, CT New natural product carbonic anhydrase inhibitors incorporating phenol moieties. Bioorg Med Chem 23:7219-25 (2015)  
Target
Name:
Carbonic anhydrase 7
Synonyms:
CA-VII CAH7_HUMAN Carbonic anhydrase Carbonic anhydrase VII (CA VII)
Type:
Enzyme
Mol. Mass.:
29664.11
Organism:
Homo sapiens (Human)
Description:
Human cloned isozyme.
Residue:
264
  
Inhibitor
Name:
BDBM50049400
Synonyms:
(+/-) taxifolin (+/-)-taxifolin (2R,3R)-2-(3,4-dihydroxyphenyl)-3,5,7-trihydroxychroman-4-one 2-(3,4-dihydroxyphenyl)-3,5,7-trihydroxychroman-4-one CHEMBL337309 | NSC-2801
Type:
Small organic molecule
Emp. Form.:
C15H12O7
Mol. Mass.:
304.2516
SMILES:
OC1C(=O)C(Oc2cc(O)cc(O)c12)c1ccc(O)c(O)c1
: