Target
Carbonic anhydrase 6
Ligand
BDBM50131679
Substrate
Meas. Tech.
ChEMBL_1523555 (CHEMBL3631203)
Ki
510±n/a nM
Citation
 Maresca, AAkyuz, GOsman, SMAlOthman, ZSupuran, CT Inhibition of mammalian carbonic anhydrase isoforms I-XIV with a series of phenolic acid esters. Bioorg Med Chem 23:7181-8 (2015)  
Target
Name:
Carbonic anhydrase 6
Synonyms:
CA-VI CAH6_HUMAN Carbonic Anhydrase VI Carbonic anhydrase 6 Carbonic anhydrase 6 (CA-VI) Salivary carbonic anhydrase | Secreted carbonic anhydrase
Type:
Enzyme
Mol. Mass.:
35371.40
Organism:
Homo sapiens (Human)
Description:
P23280
Residue:
308
  
Inhibitor
Name:
BDBM50131679
Synonyms:
CHEMBL3628211 | p-Hydroxyphenylethyl p-coumarate (17)
Type:
Small organic molecule
Emp. Form.:
C17H16O4
Mol. Mass.:
284.3065
SMILES:
Oc1ccc(CCOC(=O)\C=C\c2ccc(O)cc2)cc1
: