Target
Carbonic anhydrase 9
Ligand
BDBM50259746
Substrate
Meas. Tech.
ChEMBL_1523557 (CHEMBL3631205)
Ki
810±n/a nM
Citation
 Maresca, AAkyuz, GOsman, SMAlOthman, ZSupuran, CT Inhibition of mammalian carbonic anhydrase isoforms I-XIV with a series of phenolic acid esters. Bioorg Med Chem 23:7181-8 (2015)  
Target
Name:
Carbonic anhydrase 9
Synonyms:
CA-IX CAH9_HUMAN Carbonic anhydrase 9 (CA IX) Carbonic anhydrase 9 precursor Carbonic anhydrase IX (CAIX) Carbonic anhydrases; II & IX MN RCC-associated antigen G250
Type:
Enzyme
Mol. Mass.:
49669.03
Organism:
Homo sapiens (Human)
Description:
Catalytic domain of human cloned isozyme was used in the assay
Residue:
459
  
Inhibitor
Name:
BDBM50259746
Synonyms:
(4-Hydroxyphenyl)ethyl trans-ferulate p-Hydroxyphenethyl trans-ferulate (18) | p-hydroxyphenethyl trans-ferulate
Type:
Small organic molecule
Emp. Form.:
C18H18O5
Mol. Mass.:
314.3325
SMILES:
COc1cc(\C=C\C(=O)OCCc2ccc(O)cc2)ccc1O
: