Target
Beta-secretase 1
Ligand
BDBM50131802
Substrate
Meas. Tech.
ChEMBL_1525859 (CHEMBL3635178)
IC50
13±n/a nM
Citation
 Rombouts, FJTresadern, GDelgado, OMartínez-Lamenca, CVan Gool, MGarcía-Molina, AAlonso de Diego, SAOehlrich, DProkopcova, HAlonso, JMAustin, NBorghys, HVan Brandt, SSurkyn, MDe Cleyn, MVos, AAlexander, RMacdonald, GMoechars, DGijsen, HTrabanco, AA 1,4-Oxazineß-Secretase 1 (BACE1) Inhibitors: From Hit Generation to Orally Bioavailable Brain Penetrant Leads. J Med Chem 58:8216-35 (2015)  
Target
Name:
Beta-secretase 1
Synonyms:
ASP2 Aspartyl protease 2 BACE1 Beta-secretase (BACE) Beta-secretase 1 (BACE 1) Beta-secretase 1 (BACE1) Beta-site amyloid precursor protein cleaving enzyme 1 Memapsin-2 beta-Secretase (BACE-1) | beta-Secretase (BACE1)
Type:
Protein
Mol. Mass.:
55755.10
Organism:
Homo sapiens (Human)
Description:
P56817
Residue:
501
  
Inhibitor
Name:
BDBM50131802
Synonyms:
CHEMBL3634128
Type:
Small organic molecule
Emp. Form.:
C17H14ClF4N5O2
Mol. Mass.:
431.772
SMILES:
C[C@@]1(N=C(N)CO[C@H]1C(F)(F)F)c1cc(NC(=O)c2cnc(Cl)cn2)ccc1F
: