Target
Beta-secretase 1
Ligand
BDBM50131805
Substrate
Meas. Tech.
ChEMBL_1525859 (CHEMBL3635178)
IC50
257±n/a nM
Citation
 Rombouts, FJTresadern, GDelgado, OMartínez-Lamenca, CVan Gool, MGarcía-Molina, AAlonso de Diego, SAOehlrich, DProkopcova, HAlonso, JMAustin, NBorghys, HVan Brandt, SSurkyn, MDe Cleyn, MVos, AAlexander, RMacdonald, GMoechars, DGijsen, HTrabanco, AA 1,4-Oxazineß-Secretase 1 (BACE1) Inhibitors: From Hit Generation to Orally Bioavailable Brain Penetrant Leads. J Med Chem 58:8216-35 (2015)  
Target
Name:
Beta-secretase 1
Synonyms:
ASP2 Aspartyl protease 2 BACE1 Beta-secretase (BACE) Beta-secretase 1 (BACE 1) Beta-secretase 1 (BACE1) Beta-site amyloid precursor protein cleaving enzyme 1 Memapsin-2 beta-Secretase (BACE-1) | beta-Secretase (BACE1)
Type:
Protein
Mol. Mass.:
55755.10
Organism:
Homo sapiens (Human)
Description:
P56817
Residue:
501
  
Inhibitor
Name:
BDBM50131805
Synonyms:
CHEMBL3634338
Type:
Small organic molecule
Emp. Form.:
C16H17FN6O3
Mol. Mass.:
360.343
SMILES:
COc1cnc(cn1)C(=O)Nc1ccnc(c1)[C@@]1(C)N=C(N)CO[C@@H]1F
: