Target
Cytochrome P450 2D6
Ligand
BDBM50131808
Substrate
Meas. Tech.
ChEMBL_1525877 (CHEMBL3635363)
IC50
>10000±n/a nM
Citation
 Rombouts, FJTresadern, GDelgado, OMartínez-Lamenca, CVan Gool, MGarcía-Molina, AAlonso de Diego, SAOehlrich, DProkopcova, HAlonso, JMAustin, NBorghys, HVan Brandt, SSurkyn, MDe Cleyn, MVos, AAlexander, RMacdonald, GMoechars, DGijsen, HTrabanco, AA 1,4-Oxazineß-Secretase 1 (BACE1) Inhibitors: From Hit Generation to Orally Bioavailable Brain Penetrant Leads. J Med Chem 58:8216-35 (2015)  
Target
Name:
Cytochrome P450 2D6
Synonyms:
CP2D6_HUMAN CYP2DL1 Cytochrome P450 2D6 (CYP2D6) P450-DB1
Type:
Protein
Mol. Mass.:
55774.82
Organism:
Homo sapiens (Human)
Description:
P10635
Residue:
497
  
Inhibitor
Name:
BDBM50131808
Synonyms:
CHEMBL3634341
Type:
Small organic molecule
Emp. Form.:
C18H17ClF2N4O2
Mol. Mass.:
394.803
SMILES:
Cc1cc(Cl)cnc1C(=O)Nc1ccc(F)c(c1)[C@@]1(C)N=C(N)CO[C@@H]1F
: