Target
Tyrosine-protein kinase ITK/TSK
Ligand
BDBM50131843
Substrate
Meas. Tech.
ChEMBL_1526611 (CHEMBL3635830)
Kd
140±n/a nM
Citation
 Wurz, RPPettus, LHAshton, KBrown, JChen, JJHerberich, BHong, FTHu-Harrington, ENguyen, TSt Jean, DJTadesse, SBauer, DKubryk, MZhan, JCooke, KMitchell, PAndrews, KLHsieh, FHickman, DKalyanaraman, NWu, TReid, DLLobenhofer, EKAndrews, DAEverds, NGuzman, RParsons, ATHedley, SJTedrow, JThiel, ORPotter, MRadinsky, RBeltran, PJTasker, AS Oxopyrido[2,3-d]pyrimidines as Covalent L858R/T790M Mutant Selective Epidermal Growth Factor Receptor (EGFR) Inhibitors. ACS Med Chem Lett 6:987-92 (2015)  
Target
Name:
Tyrosine-protein kinase ITK/TSK
Synonyms:
EMT ITK_HUMAN LYK Tyrosine-protein kinase ITK Tyrosine-protein kinase Lyk
Type:
Protein
Mol. Mass.:
71839.20
Organism:
Homo sapiens (Human)
Description:
Q08881
Residue:
620
  
Inhibitor
Name:
BDBM50131843
Synonyms:
CHEMBL3633152
Type:
Small organic molecule
Emp. Form.:
C28H30N6O4
Mol. Mass.:
514.5756
SMILES:
COc1cc(OCCN(C)C)ccc1Nc1ncc2c(C)cc(=O)n(-c3cccc(NC(=O)C=C)c3)c2n1
: