Target
Vascular endothelial growth factor receptor 2
Ligand
BDBM21
Substrate
Meas. Tech.
ChEMBL_1527399 (CHEMBL3636774)
IC50
62±n/a nM
Citation
 Peng, FWWu, TTRen, ZWXue, JYShi, L Hybrids from 4-anilinoquinazoline and hydroxamic acid as dual inhibitors of vascular endothelial growth factor receptor-2 and histone deacetylase. Bioorg Med Chem Lett 25:5137-41 (2015)  
Target
Name:
Vascular endothelial growth factor receptor 2
Synonyms:
CD_antigen=CD309 Fetal liver kinase 1 (FLK-1) KDR Protein-tyrosine kinase receptor Flk-1 VEGFR-2 VEGFR2 Vascular Endothelial Growth Factor Receptor Kinase 2 Vascular endothelial growth factor receptor 2 (KDR) Vascular endothelial growth factor receptor 2 (VEGFR2) Vascular endothelial growth factor receptor-2 (VEGFR-2)
Type:
Receptor Tyrosine Kinase
Mol. Mass.:
151510.97
Organism:
Homo sapiens (Human)
Description:
P35968
Residue:
1356
  
Inhibitor
Name:
BDBM21
Synonyms:
CHEMBL24828 VANDETANIB ZD6474 | cid_3081361
Type:
Emp. Form.:
C22H24BrFN4O2
Mol. Mass.:
475.354
SMILES:
COc1cc2c(Nc3ccc(Br)cc3F)ncnc2cc1OCC1CCN(C)CC1
: