Target
Mucosa-associated lymphoid tissue lymphoma translocation protein 1
Ligand
BDBM50133339
Substrate
Meas. Tech.
ChEMBL_1525779 (CHEMBL3635348)
IC50
5400±n/a nM
Citation
 Lim, SMJeong, YLee, SIm, HTae, HSKim, BGPark, HDPark, JHong, S Identification of฿-Lapachone Analogs as Novel MALT1 Inhibitors To Treat an Aggressive Subtype of Diffuse Large B-Cell Lymphoma. J Med Chem 58:8491-502 (2015)  
Target
Name:
Mucosa-associated lymphoid tissue lymphoma translocation protein 1
Synonyms:
MALT lymphoma-associated translocation MALT1 MLT Paracaspase
Type:
Enzyme
Mol. Mass.:
92257.81
Organism:
Homo sapiens (Human)
Description:
Q9UDY8
Residue:
824
  
Inhibitor
Name:
BDBM50133339
Synonyms:
CHEMBL3635002
Type:
Small organic molecule
Emp. Form.:
C22H22N2O2
Mol. Mass.:
346.4223
SMILES:
O=C1C=C(NC2CCN(Cc3ccccc3)CC2)c2ccccc2C1=O
: