Target
Mucosa-associated lymphoid tissue lymphoma translocation protein 1
Ligand
BDBM50133342
Substrate
Meas. Tech.
ChEMBL_1525779 (CHEMBL3635348)
IC50
14900±n/a nM
Citation
 Lim, SMJeong, YLee, SIm, HTae, HSKim, BGPark, HDPark, JHong, S Identification of฿-Lapachone Analogs as Novel MALT1 Inhibitors To Treat an Aggressive Subtype of Diffuse Large B-Cell Lymphoma. J Med Chem 58:8491-502 (2015)  
Target
Name:
Mucosa-associated lymphoid tissue lymphoma translocation protein 1
Synonyms:
MALT lymphoma-associated translocation MALT1 MLT Paracaspase
Type:
Enzyme
Mol. Mass.:
92257.81
Organism:
Homo sapiens (Human)
Description:
Q9UDY8
Residue:
824
  
Inhibitor
Name:
BDBM50133342
Synonyms:
CHEMBL3635000
Type:
Small organic molecule
Emp. Form.:
C17H20N2O4
Mol. Mass.:
316.3517
SMILES:
CC(C)(C)OC(=O)NCCNC1=CC(=O)C(=O)c2ccccc12
: