Target
Carbonic anhydrase 14
Ligand
BDBM50133406
Substrate
Meas. Tech.
ChEMBL_1525822 (CHEMBL3635736)
Ki
8.5±n/a nM
Citation
 La Regina, GColuccia, AFamiglini, VPelliccia, SMonti, LVullo, DNuti, EAlterio, VDe Simone, GMonti, SMPan, PParkkila, SSupuran, CTRossello, ASilvestri, R Discovery of 1,1'-Biphenyl-4-sulfonamides as a New Class of Potent and Selective Carbonic Anhydrase XIV Inhibitors. J Med Chem 58:8564-72 (2015)  
Target
Name:
Carbonic anhydrase 14
Synonyms:
CA-XIV CAH14_HUMAN Carbonic Anhydrase XIV Carbonic anhydrase 14 Carbonic anhydrase XIV (CA XIV)
Type:
Enzyme
Mol. Mass.:
37665.67
Organism:
Homo sapiens (Human)
Description:
Human (cloned) isozyme.
Residue:
337
  
Inhibitor
Name:
BDBM50133406
Synonyms:
CHEMBL3632842
Type:
Small organic molecule
Emp. Form.:
C19H16N2O5S
Mol. Mass.:
384.406
SMILES:
NS(=O)(=O)c1ccc(cc1)-c1ccc(cc1)C(O)c1ccc(cc1)[N+]([O-])=O
: