Target
Orexin/Hypocretin receptor type 1
Ligand
BDBM50133880
Substrate
Meas. Tech.
ChEMBL_1526534 (CHEMBL3635422)
Ki
63±n/a nM
Citation
 Behnke, DCotesta, SHintermann, SFendt, MGee, CEJacobson, LHLaue, GMeyer, AWagner, TBadiger, SChaudhari, VChebrolu, MPandit, CHoyer, DBetschart, C Discovery of 1H-pyrazolo[3,4-b]pyridines as potent dual orexin receptor antagonists (DORAs). Bioorg Med Chem Lett 25:5555-60 (2015)  
Target
Name:
Orexin/Hypocretin receptor type 1
Synonyms:
HCRTR1 OX1R_HUMAN Orexin receptor type 1 (OR 1) Orexin receptor type 1 (OX1) Orexin receptor type 1 (OxR1) | Ox1r
Type:
Protein
Mol. Mass.:
47554.50
Organism:
Homo sapiens (Human)
Description:
O43613
Residue:
425
  
Inhibitor
Name:
BDBM50133880
Synonyms:
CHEMBL3634028
Type:
Small organic molecule
Emp. Form.:
C24H26F2N6O2
Mol. Mass.:
468.499
SMILES:
CC(NC(=O)COc1cc(C(F)F)c2c(nn(C)c2n1)-c1ccccc1)c1c(C)nn(C)c1C
: