Target
Orexin receptor type 2
Ligand
BDBM123338
Substrate
Meas. Tech.
ChEMBL_1526535 (CHEMBL3635423)
Ki
3.0±n/a nM
Citation
 Behnke, DCotesta, SHintermann, SFendt, MGee, CEJacobson, LHLaue, GMeyer, AWagner, TBadiger, SChaudhari, VChebrolu, MPandit, CHoyer, DBetschart, C Discovery of 1H-pyrazolo[3,4-b]pyridines as potent dual orexin receptor antagonists (DORAs). Bioorg Med Chem Lett 25:5555-60 (2015)  
Target
Name:
Orexin receptor type 2
Synonyms:
HCRTR2 OX2R_HUMAN Orexin receptor type 2 (OR-2) Orexin receptor type 2 (OX2R) Ox-2-R | Ox2-R
Type:
Protein
Mol. Mass.:
50710.53
Organism:
Homo sapiens (Human)
Description:
O43614
Residue:
444
  
Inhibitor
Name:
BDBM123338
Synonyms:
US8742106, 1.38
Type:
Small organic molecule
Emp. Form.:
C23H23F3N6O2
Mol. Mass.:
472.4629
SMILES:
CC(NC(=O)COc1cc(c2c(nn(C)c2n1)-c1ccccc1)C(F)(F)F)c1c(C)n[nH]c1C
: