Target
Carbonic anhydrase
Ligand
BDBM10861
Substrate
Meas. Tech.
ChEMBL_1543853 (CHEMBL3749743)
Ki
73±n/a nM
Citation
 Vullo, DBhatt, AMahon, BPMcKenna, RSupuran, CT Sulfonamide inhibition studies of thea-carbonic anhydrase from the gammaproteobacterium Thiomicrospira crunogena XCL-2, TcruCA. Bioorg Med Chem Lett 26:401-5 (2016)  
Target
Name:
Carbonic anhydrase
Synonyms:
4.2.1.1 | Carbonate dehydratase
Type:
PROTEIN
Mol. Mass.:
28438.71
Organism:
Sulfurihydrogenibium sp. (strain YO3AOP1)
Description:
ChEMBL_116696
Residue:
246
  
Inhibitor
Name:
BDBM10861
Synonyms:
4-(2-aminoethyl)benzene-1-sulfonamide aromatic sulfonamide compound 7 | aromatic/heteroaromatic sulfonamide 6
Type:
Small organic molecule
Emp. Form.:
C8H12N2O2S
Mol. Mass.:
200.258
SMILES:
NCCc1ccc(cc1)S(N)(=O)=O
: