Target
Seed linoleate 13S-lipoxygenase-1
Ligand
BDBM50135282
Substrate
Meas. Tech.
ChEMBL_1546118 (CHEMBL3749636)
IC50
400±n/a nM
Citation
 Averina, EBVasilenko, DAGracheva, YAGrishin, YKRadchenko, EVBurmistrov, VVButov, GMNeganova, MESerkova, TPRedkozubova, OMShevtsova, EFMilaeva, ERKuznetsova, TSZefirov, NS Synthesis and biological evaluation of novel 5-hydroxylaminoisoxazole derivatives as lipoxygenase inhibitors and metabolism enhancing agents. Bioorg Med Chem 24:712-20 (2016)  
Target
Name:
Seed linoleate 13S-lipoxygenase-1
Synonyms:
15-LOX 15-lipo-oxygenase (SLO) L-1 LOX1.1 Lipoxygenase (LOX) Lipoxygenase-1 | Seed lipoxygenase-1
Type:
Enzyme
Mol. Mass.:
94365.66
Organism:
Glycine max (soybean)
Description:
Residue:
839
  
Inhibitor
Name:
BDBM50135282
Synonyms:
CHEMBL3746867
Type:
Small organic molecule
Emp. Form.:
C20H28N2O5
Mol. Mass.:
376.4467
SMILES:
ON(C1CCCO1)c1cc(no1)C(=O)OCCC12CC3CC(CC(C3)C1)C2
: