Target
Histamine H3 receptor
Ligand
BDBM50138119
Substrate
Meas. Tech.
ChEMBL_1549945 (CHEMBL3755092)
Ki
0.030000±n/a nM
Citation
 Nirogi, RShinde, ATiriveedhi, VKota, LSaraf, SKBadange, RKMohammed, ARSubramanian, RMuddana, NBhyrapuneni, GAbraham, R Benzamide derivatives and their constrained analogs as histamine H3 receptor antagonists. Eur J Med Chem 108:655-62 (2016)  
Target
Name:
Histamine H3 receptor
Synonyms:
G-protein coupled receptor 97 HH3R HRH3 Histamine H3 receptor (H3) Histamine receptor (H3 and H4)
Type:
G Protein-Coupled Receptor (GPCR)
Mol. Mass.:
48691.47
Organism:
Homo sapiens (Human)
Description:
Binding assays were using CHO cells stably expressing hH3R receptors.
Residue:
445
  
Inhibitor
Name:
BDBM50138119
Synonyms:
CHEMBL3753475
Type:
Small organic molecule
Emp. Form.:
C27H39N3O2
Mol. Mass.:
437.6175
SMILES:
O=C1N(CCc2cc(OC3CCN(CC3)C3CCC3)ccc12)C1CCN(CC1)C1CCC1
: