Target
Beta-secretase 1
Ligand
BDBM50138279
Substrate
Meas. Tech.
ChEMBL_1549920 (CHEMBL3755067)
IC50
1350±n/a nM
Citation
 Zha, XLamba, DZhang, LLou, YXu, CKang, DChen, LXu, YZhang, LDe Simone, ASamez, SPesaresi, AStojan, JLopez, MGEgea, JAndrisano, VBartolini, M Novel Tacrine-Benzofuran Hybrids as Potent Multitarget-Directed Ligands for the Treatment of Alzheimer's Disease: Design, Synthesis, Biological Evaluation, and X-ray Crystallography. J Med Chem 59:114-31 (2016)  
Target
Name:
Beta-secretase 1
Synonyms:
ASP2 Aspartyl protease 2 BACE1 Beta-secretase (BACE) Beta-secretase 1 (BACE 1) Beta-secretase 1 (BACE1) Beta-site amyloid precursor protein cleaving enzyme 1 Memapsin-2 beta-Secretase (BACE-1) | beta-Secretase (BACE1)
Type:
Protein
Mol. Mass.:
55755.10
Organism:
Homo sapiens (Human)
Description:
P56817
Residue:
501
  
Inhibitor
Name:
BDBM50138279
Synonyms:
CHEMBL3752467
Type:
Small organic molecule
Emp. Form.:
C29H35N3O
Mol. Mass.:
441.6077
SMILES:
C(CCCNCc1cc2ccccc2o1)CCCNc1c2CCCCc2nc2ccccc12
: