Target
Acetylcholinesterase
Ligand
BDBM50138279
Substrate
Meas. Tech.
ChEMBL_1549912 (CHEMBL3758061)
IC50
0.860000±n/a nM
Citation
 Zha, XLamba, DZhang, LLou, YXu, CKang, DChen, LXu, YZhang, LDe Simone, ASamez, SPesaresi, AStojan, JLopez, MGEgea, JAndrisano, VBartolini, M Novel Tacrine-Benzofuran Hybrids as Potent Multitarget-Directed Ligands for the Treatment of Alzheimer's Disease: Design, Synthesis, Biological Evaluation, and X-ray Crystallography. J Med Chem 59:114-31 (2016)  
Target
Name:
Acetylcholinesterase
Synonyms:
ACES_HUMAN Acetylcholinesterase (AChE) | Acetylcholinesterase (human AChE)
Type:
Enzyme
Mol. Mass.:
67792.70
Organism:
Homo sapiens (Human)
Description:
P22303
Residue:
614
  
Inhibitor
Name:
BDBM50138279
Synonyms:
CHEMBL3752467
Type:
Small organic molecule
Emp. Form.:
C29H35N3O
Mol. Mass.:
441.6077
SMILES:
C(CCCNCc1cc2ccccc2o1)CCCNc1c2CCCCc2nc2ccccc12
: