Target
Matrix metalloproteinase-9
Ligand
BDBM50314228
Substrate
Meas. Tech.
ChEMBL_1550087 (CHEMBL3756033)
IC50
7.2±n/a nM
Citation
 Sjøli, SNuti, ECamodeca, CBilto, IRossello, AWinberg, JOSylte, IAdekoya, OA Synthesis, experimental evaluation and molecular modelling of hydroxamate derivatives as zinc metalloproteinase inhibitors. Eur J Med Chem 108:141-53 (2016)  
Target
Name:
Matrix metalloproteinase-9
Synonyms:
67 kDa matrix metalloproteinase-9 92 kDa gelatinase CLG4B Gelatinase B MMP9 Matrix metalloproteinase 9 (MMP-9) Matrix metalloproteinase-9 (MMP9)
Type:
Enzyme
Mol. Mass.:
78452.28
Organism:
Homo sapiens (Human)
Description:
P14780
Residue:
707
  
Inhibitor
Name:
BDBM50314228
Synonyms:
(R)-N-hydroxy-2-(N-isobutyl-4-methoxyphenylsulfonamido)-3-methylbutanamide | CHEMBL1090284
Type:
Small organic molecule
Emp. Form.:
C16H26N2O5S
Mol. Mass.:
358.453
SMILES:
COc1ccc(cc1)S(=O)(=O)N(CC(C)C)[C@H](C(C)C)C(=O)NO
: