Target
Serum paraoxonase/arylesterase 1
Ligand
BDBM50139134
Substrate
Meas. Tech.
ChEBML_1552279
IC50
40000±n/a nM
Citation
 Karatas, MOUslu, HAlici, BGökçe, BGencer, NArslan, OArslan, NBÖzdemir, N Functionalized imidazolium and benzimidazolium salts as paraoxonase 1 inhibitors: Synthesis, characterization and molecular docking studies. Bioorg Med Chem 24:1392-401 (2016)  
Target
Name:
Serum paraoxonase/arylesterase 1
Synonyms:
A-esterase 1 K-45 PON 1 PON1_HUMAN Paraoxonase (hPON1) Serum aryldialkylphosphatase 1 | Serum paraoxonase 1 (PON1)
Type:
Enzyme
Mol. Mass.:
39719.73
Organism:
Homo sapiens (Human)
Description:
P27169
Residue:
355
  
Inhibitor
Name:
BDBM50139134
Synonyms:
CHEMBL3758686
Type:
Small organic molecule
Emp. Form.:
C14H15ClO2
Mol. Mass.:
250.721
SMILES:
CC(C)(C)c1ccc2oc(=O)cc(CCl)c2c1
: