Target
Serum paraoxonase/arylesterase 1
Ligand
BDBM50144742
Substrate
Meas. Tech.
ChEMBL_1552279 (CHEMBL3761350)
IC50
2064200±n/a nM
Citation
 Karatas, MOUslu, HAlici, BGökçe, BGencer, NArslan, OArslan, NBÖzdemir, N Functionalized imidazolium and benzimidazolium salts as paraoxonase 1 inhibitors: Synthesis, characterization and molecular docking studies. Bioorg Med Chem 24:1392-401 (2016)  
Target
Name:
Serum paraoxonase/arylesterase 1
Synonyms:
A-esterase 1 K-45 PON 1 PON1_HUMAN Paraoxonase (hPON1) Serum aryldialkylphosphatase 1 | Serum paraoxonase 1 (PON1)
Type:
Enzyme
Mol. Mass.:
39719.73
Organism:
Homo sapiens (Human)
Description:
P27169
Residue:
355
  
Inhibitor
Name:
BDBM50144742
Synonyms:
CHEMBL3758332
Type:
Small organic molecule
Emp. Form.:
C21H18ClN5
Mol. Mass.:
375.854
SMILES:
[Cl-].C(n1c[n+](Cc2ccccc2)c2ccccc12)n1nnc2ccccc12
: