Target
L-lactate dehydrogenase A chain
Ligand
BDBM50144793
Substrate
Meas. Tech.
ChEMBL_1555230 (CHEMBL3768756)
Ki
200±n/a nM
Citation
 Rani, RKumar, V Recent Update on Human Lactate Dehydrogenase Enzyme 5 (hLDH5) Inhibitors: A Promising Approach for Cancer Chemotherapy. J Med Chem 59:487-96 (2016)  
Target
Name:
L-lactate dehydrogenase A chain
Synonyms:
Cell proliferation-inducing gene 19 protein L-lactate dehydrogenase A Chain LDH-A LDHA Lactate dehydrogenase A (LDHA) | Renal carcinoma antigen NY-REN-59
Type:
Protein
Mol. Mass.:
36694.85
Organism:
Homo sapiens (Human)
Description:
P00338::PDB Code: 4ajp
Residue:
332
  
Inhibitor
Name:
BDBM50144793
Synonyms:
CHEMBL3765804
Type:
Small organic molecule
Emp. Form.:
C22H22O4
Mol. Mass.:
350.4077
SMILES:
CC(C)c1c(O)c(O)c(C(O)=O)c2cc(c(C)cc12)-c1cccc(C)c1
: