Target
L-lactate dehydrogenase B chain
Ligand
BDBM50010449
Substrate
Meas. Tech.
ChEMBL_1555231 (CHEMBL3768757)
Ki
400±n/a nM
Citation
 Rani, RKumar, V Recent Update on Human Lactate Dehydrogenase Enzyme 5 (hLDH5) Inhibitors: A Promising Approach for Cancer Chemotherapy. J Med Chem 59:487-96 (2016)  
Target
Name:
L-lactate dehydrogenase B chain
Synonyms:
L-lactate dehydrogenase B LDH heart subunit LDH-H LDHB_HUMAN Renal carcinoma antigen NY-REN-46
Type:
Oxidoreductase; homotetramer
Mol. Mass.:
36635.55
Organism:
Homo sapiens (Human)
Description:
Residue:
334
  
Inhibitor
Name:
BDBM50010449
Synonyms:
3,4,3',4'-Tetrahydroxy-5,5'-diisopropyl-7,7'-dimethyl-[8,8']bi[naphtho[1,8-bc]furanyl]-2,2'-dione | CHEMBL110030
Type:
Small organic molecule
Emp. Form.:
C30H26O8
Mol. Mass.:
514.5226
SMILES:
CC(C)c1c(O)c(O)c2C(=O)Oc3c(c(C)cc1c23)-c1c2OC(=O)c3c(O)c(O)c(C(C)C)c(cc1C)c23
: