Target
L-lactate dehydrogenase B chain
Ligand
BDBM50144793
Substrate
Meas. Tech.
ChEMBL_1555231 (CHEMBL3768757)
Ki
34000±n/a nM
Citation
 Rani, RKumar, V Recent Update on Human Lactate Dehydrogenase Enzyme 5 (hLDH5) Inhibitors: A Promising Approach for Cancer Chemotherapy. J Med Chem 59:487-96 (2016)  
Target
Name:
L-lactate dehydrogenase B chain
Synonyms:
L-lactate dehydrogenase B LDH heart subunit LDH-H LDHB_HUMAN Renal carcinoma antigen NY-REN-46
Type:
Oxidoreductase; homotetramer
Mol. Mass.:
36635.55
Organism:
Homo sapiens (Human)
Description:
Residue:
334
  
Inhibitor
Name:
BDBM50144793
Synonyms:
CHEMBL3765804
Type:
Small organic molecule
Emp. Form.:
C22H22O4
Mol. Mass.:
350.4077
SMILES:
CC(C)c1c(O)c(O)c(C(O)=O)c2cc(c(C)cc12)-c1cccc(C)c1
: