Target
L-lactate dehydrogenase A chain
Ligand
BDBM50066974
Substrate
Meas. Tech.
ChEMBL_1555230 (CHEMBL3768756)
Ki
50±n/a nM
Citation
 Rani, RKumar, V Recent Update on Human Lactate Dehydrogenase Enzyme 5 (hLDH5) Inhibitors: A Promising Approach for Cancer Chemotherapy. J Med Chem 59:487-96 (2016)  
Target
Name:
L-lactate dehydrogenase A chain
Synonyms:
Cell proliferation-inducing gene 19 protein L-lactate dehydrogenase A Chain LDH-A LDHA Lactate dehydrogenase A (LDHA) | Renal carcinoma antigen NY-REN-59
Type:
Protein
Mol. Mass.:
36694.85
Organism:
Homo sapiens (Human)
Description:
P00338::PDB Code: 4ajp
Residue:
332
  
Inhibitor
Name:
BDBM50066974
Synonyms:
7-Benzyl-2,3-dihydroxy-6-methyl-4-propyl-naphthalene-1-carboxylic acid LDHA Inhibitor, 3
Type:
Small organic molecule
Emp. Form.:
C22H22O4
Mol. Mass.:
350.4077
SMILES:
CCCc1c(O)c(O)c(C(O)=O)c2cc(Cc3ccccc3)c(C)cc12
: