Target
Plasmepsin I
Ligand
BDBM50145773
Substrate
Meas. Tech.
ChEMBL_1553799 (CHEMBL3767014)
IC50
270±n/a nM
Citation
 Rasina, DOtikovs, MLeitans, JRecacha, RBorysov, OVKanepe-Lapsa, IDomraceva, IPantelejevs, TTars, KBlackman, MJJaudzems, KJirgensons, A Fragment-Based Discovery of 2-Aminoquinazolin-4(3H)-ones As Novel Class Nonpeptidomimetic Inhibitors of the Plasmepsins I, II, and IV. J Med Chem 59:374-87 (2016)  
Target
Name:
Plasmepsin I
Synonyms:
PFAPG PMI Plasmepsin-1 precursor
Type:
Enzyme
Mol. Mass.:
51463.30
Organism:
Plasmodium falciparum
Description:
Residue:
452
  
Inhibitor
Name:
BDBM50145773
Synonyms:
CHEMBL3765317
Type:
Small organic molecule
Emp. Form.:
C29H29N3O4
Mol. Mass.:
483.5583
SMILES:
COC(=O)CCc1ccc(cc1)-c1ccc2c(c1)nc(N)n(C[C@@H]1CC[C@@H](O1)c1ccccc1)c2=O
: