Target
Multidrug resistance-associated protein 1
Ligand
BDBM50139438
Substrate
Meas. Tech.
ChEBML_1553383
IC50
53300±n/a nM
Citation
 Obreque-Balboa, JESun, QBernhardt, GKönig, BBuschauer, A Flavonoid derivatives as selective ABCC1 modulators: Synthesis and functional characterization. Eur J Med Chem 109:124-33 (2016)  
Target
Name:
Multidrug resistance-associated protein 1
Synonyms:
7.6.2.2 ABCC1 ATP-binding cassette, sub-family C, member 1 isoform 1 LTC4 transporter MRP MRP1_HUMAN
Type:
Mol. Mass.:
171597.72
Organism:
Homo sapiens (Human)
Description:
P33527
Residue:
1531
  
Inhibitor
Name:
BDBM50139438
Synonyms:
CHEMBL3765272
Type:
Small organic molecule
Emp. Form.:
C18H24N2O5
Mol. Mass.:
348.3936
SMILES:
COc1cc(OC)c2c(c1)oc(NCCCN1CCOCC1)cc2=O
: