Target
Histone deacetylase 6
Ligand
BDBM50141139
Substrate
Meas. Tech.
ChEMBL_1551265 (CHEMBL3762116)
IC50
151±n/a nM
Citation
 Thaler, FMoretti, LAmici, RAbate, AColombo, ACarenzi, GFulco, MCBoggio, RDondio, GGagliardi, SMinucci, SSartori, LVarasi, MMercurio, C Synthesis, biological characterization and molecular modeling insights of spirochromanes as potent HDAC inhibitors. Eur J Med Chem 108:53-67 (2016)  
Target
Name:
Histone deacetylase 6
Synonyms:
Cereblon/Histone deacetylase 6 HDAC6 Histone deacetylase 6 (HDAC6) KIAA0901 | ORF Names:JM21
Type:
Chromatin regulator; hydrolase; repressor
Mol. Mass.:
131381.51
Organism:
Homo sapiens (Human)
Description:
Q9UBN7
Residue:
1215
  
Inhibitor
Name:
BDBM50141139
Synonyms:
CHEMBL3759808
Type:
Small organic molecule
Emp. Form.:
C24H26N2O4
Mol. Mass.:
406.4742
SMILES:
ONC(=O)\C=C\c1ccc2OC3(CC(=O)c2c1)CCCN(Cc1ccccc1)CC3
: