Target
Cytochrome P450 2C9
Ligand
BDBM50143059
Substrate
Meas. Tech.
ChEMBL_1550588 (CHEMBL3762442)
IC50
>30000±n/a nM
Citation
 Garcia-Barrantes, PMCho, HPMetts, AMBlobaum, ALNiswender, CMConn, PJLindsley, CW Lead optimization of the VU0486321 series of mGlu(1) PAMs. Part 2: SAR of alternative 3-methyl heterocycles and progress towards an in vivo tool. Bioorg Med Chem Lett 26:751-6 (2016)  
Target
Name:
Cytochrome P450 2C9
Synonyms:
(R)-limonene 6-monooxygenase CP2C9_HUMAN CYP2C9 Cytochrome P450 2C9 (CYP2C9 ) P-450MP P450 PB-1 | S-mephenytoin 4-hydroxylase
Type:
Enzyme
Mol. Mass.:
55636.33
Organism:
Homo sapiens (Human)
Description:
P11712
Residue:
490
  
Inhibitor
Name:
BDBM50143059
Synonyms:
CHEMBL3758746
Type:
Small organic molecule
Emp. Form.:
C21H15FN2O4
Mol. Mass.:
378.3532
SMILES:
Cc1ccoc1C(=O)Nc1ccc(cc1F)N1C(=O)c2ccc(C)cc2C1=O
: