Target
Cytochrome P450 2D6
Ligand
BDBM50143063
Substrate
Meas. Tech.
ChEMBL_1550589 (CHEMBL3762443)
IC50
>30000±n/a nM
Citation
 Garcia-Barrantes, PMCho, HPMetts, AMBlobaum, ALNiswender, CMConn, PJLindsley, CW Lead optimization of the VU0486321 series of mGlu(1) PAMs. Part 2: SAR of alternative 3-methyl heterocycles and progress towards an in vivo tool. Bioorg Med Chem Lett 26:751-6 (2016)  
Target
Name:
Cytochrome P450 2D6
Synonyms:
CP2D6_HUMAN CYP2DL1 Cytochrome P450 2D6 (CYP2D6) P450-DB1
Type:
Protein
Mol. Mass.:
55774.82
Organism:
Homo sapiens (Human)
Description:
P10635
Residue:
497
  
Inhibitor
Name:
BDBM50143063
Synonyms:
CHEMBL3758465
Type:
Small organic molecule
Emp. Form.:
C20H12F2N2O4
Mol. Mass.:
382.3171
SMILES:
Cc1ccoc1C(=O)Nc1ccc(cc1F)N1C(=O)c2cccc(F)c2C1=O
: