Target
Cytochrome P450 3A4
Ligand
BDBM50143061
Substrate
Meas. Tech.
ChEMBL_1550590 (CHEMBL3762444)
IC50
>30000±n/a nM
Citation
 Garcia-Barrantes, PMCho, HPMetts, AMBlobaum, ALNiswender, CMConn, PJLindsley, CW Lead optimization of the VU0486321 series of mGlu(1) PAMs. Part 2: SAR of alternative 3-methyl heterocycles and progress towards an in vivo tool. Bioorg Med Chem Lett 26:751-6 (2016)  
Target
Name:
Cytochrome P450 3A4
Synonyms:
Albendazole monooxygenase CP3A4_HUMAN CYP3A4 CYPIIIA4 Cytochrome P450 3A4 (CYP3A4) Nifedipine oxidase Taurochenodeoxycholate 6-alpha-hydroxylase
Type:
Enzyme
Mol. Mass.:
57349.57
Organism:
Homo sapiens (Human)
Description:
Residue:
503
  
Inhibitor
Name:
BDBM50143061
Synonyms:
CHEMBL3759901
Type:
Small organic molecule
Emp. Form.:
C20H12ClFN2O4
Mol. Mass.:
398.772
SMILES:
Cc1ccoc1C(=O)Nc1ccc(cc1F)N1C(=O)c2ccc(Cl)cc2C1=O
: