Target
Metabotropic glutamate receptor 4
Ligand
BDBM50143081
Substrate
Meas. Tech.
ChEMBL_1550579 (CHEMBL3762433)
EC50
>10000±n/a nM
Citation
 Garcia-Barrantes, PMCho, HPMetts, AMBlobaum, ALNiswender, CMConn, PJLindsley, CW Lead optimization of the VU0486321 series of mGlu(1) PAMs. Part 2: SAR of alternative 3-methyl heterocycles and progress towards an in vivo tool. Bioorg Med Chem Lett 26:751-6 (2016)  
Target
Name:
Metabotropic glutamate receptor 4
Synonyms:
GPRC1D GRM4_HUMAN MGLUR4 Metabotropic glutamate receptor 4 (mGlu4) metabotropic glutamate 4
Type:
Protein
Mol. Mass.:
101899.95
Organism:
Homo sapiens (Human)
Description:
Q14833
Residue:
912
  
Inhibitor
Name:
BDBM50143081
Synonyms:
CHEMBL3759028
Type:
Small organic molecule
Emp. Form.:
C19H12ClFN4O3
Mol. Mass.:
398.775
SMILES:
Cc1cn[nH]c1C(=O)Nc1ccc(N2C(=O)c3cccc(F)c3C2=O)c(Cl)c1
: