Target
Metabotropic glutamate receptor 4
Ligand
BDBM50143086
Substrate
Meas. Tech.
ChEMBL_1550579 (CHEMBL3762433)
EC50
405±n/a nM
Citation
 Garcia-Barrantes, PMCho, HPMetts, AMBlobaum, ALNiswender, CMConn, PJLindsley, CW Lead optimization of the VU0486321 series of mGlu(1) PAMs. Part 2: SAR of alternative 3-methyl heterocycles and progress towards an in vivo tool. Bioorg Med Chem Lett 26:751-6 (2016)  
Target
Name:
Metabotropic glutamate receptor 4
Synonyms:
GPRC1D GRM4_HUMAN MGLUR4 Metabotropic glutamate receptor 4 (mGlu4) metabotropic glutamate 4
Type:
Protein
Mol. Mass.:
101899.95
Organism:
Homo sapiens (Human)
Description:
Q14833
Residue:
912
  
Inhibitor
Name:
BDBM50143086
Synonyms:
CHEMBL3759289
Type:
Small organic molecule
Emp. Form.:
C19H11Cl2N3O4
Mol. Mass.:
416.214
SMILES:
Cc1ocnc1C(=O)Nc1ccc(N2C(=O)c3ccc(Cl)cc3C2=O)c(Cl)c1
: