Target
Metabotropic glutamate receptor 5
Ligand
BDBM50143060
Substrate
Meas. Tech.
ChEMBL_1550598 (CHEMBL3762452)
EC50
>10000±n/a nM
Citation
 Garcia-Barrantes, PMCho, HPMetts, AMBlobaum, ALNiswender, CMConn, PJLindsley, CW Lead optimization of the VU0486321 series of mGlu(1) PAMs. Part 2: SAR of alternative 3-methyl heterocycles and progress towards an in vivo tool. Bioorg Med Chem Lett 26:751-6 (2016)  
Target
Name:
Metabotropic glutamate receptor 5
Synonyms:
GPRC1E GRM5_HUMAN metabotropic glutamate 5 | metabotropic glutamate 5a
Type:
Enzyme
Mol. Mass.:
132484.72
Organism:
Homo sapiens (Human)
Description:
Residue:
1212
  
Inhibitor
Name:
BDBM50143060
Synonyms:
CHEMBL3758305
Type:
Small organic molecule
Emp. Form.:
C21H15FN2O4
Mol. Mass.:
378.3532
SMILES:
Cc1ccoc1C(=O)Nc1ccc(cc1F)N1C(=O)c2cccc(C)c2C1=O
: