Target
Metabotropic glutamate receptor 1
Ligand
BDBM50143059
Substrate
Meas. Tech.
ChEMBL_1550577 (CHEMBL3762431)
EC50
11.5±n/a nM
Citation
 Garcia-Barrantes, PMCho, HPMetts, AMBlobaum, ALNiswender, CMConn, PJLindsley, CW Lead optimization of the VU0486321 series of mGlu(1) PAMs. Part 2: SAR of alternative 3-methyl heterocycles and progress towards an in vivo tool. Bioorg Med Chem Lett 26:751-6 (2016)  
Target
Name:
Metabotropic glutamate receptor 1
Synonyms:
GPRC1A GRM1_HUMAN Metabotropic Glutamate 1a | metabotropic glutamate 1
Type:
Enzyme
Mol. Mass.:
132358.19
Organism:
Homo sapiens (Human)
Description:
Q13255
Residue:
1194
  
Inhibitor
Name:
BDBM50143059
Synonyms:
CHEMBL3758746
Type:
Small organic molecule
Emp. Form.:
C21H15FN2O4
Mol. Mass.:
378.3532
SMILES:
Cc1ccoc1C(=O)Nc1ccc(cc1F)N1C(=O)c2ccc(C)cc2C1=O
: