Target
Metabotropic glutamate receptor 1
Ligand
BDBM50143153
Substrate
Meas. Tech.
ChEMBL_1550577 (CHEMBL3762431)
EC50
>10000±n/a nM
Citation
 Garcia-Barrantes, PMCho, HPMetts, AMBlobaum, ALNiswender, CMConn, PJLindsley, CW Lead optimization of the VU0486321 series of mGlu(1) PAMs. Part 2: SAR of alternative 3-methyl heterocycles and progress towards an in vivo tool. Bioorg Med Chem Lett 26:751-6 (2016)  
Target
Name:
Metabotropic glutamate receptor 1
Synonyms:
GPRC1A GRM1_HUMAN Metabotropic Glutamate 1a | metabotropic glutamate 1
Type:
Enzyme
Mol. Mass.:
132358.19
Organism:
Homo sapiens (Human)
Description:
Q13255
Residue:
1194
  
Inhibitor
Name:
BDBM50143153
Synonyms:
CHEMBL3759672
Type:
Small organic molecule
Emp. Form.:
C18H12ClN5O3
Mol. Mass.:
381.773
SMILES:
Cn1ccnc1C(=O)Nc1ccc(N2C(=O)c3cccnc3C2=O)c(Cl)c1
: