Target
Cyclin-dependent kinase 2/G1/S-specific cyclin-E1
Ligand
BDBM50143546
Substrate
Meas. Tech.
ChEMBL_1552363 (CHEMBL3761527)
IC50
>50000±n/a nM
Citation
 Huang, XHuang, RLiao, ZPan, YGou, SWang, H Synthesis and pharmacological evaluation of dehydroabietic acid thiourea derivatives containing bisphosphonate moiety as an inducer of apoptosis. Eur J Med Chem 108:381-91 (2016)  
Target
Name:
Cyclin-dependent kinase 2/G1/S-specific cyclin-E1
Synonyms:
CDK2/CycE CDK2/E Cyclin-Dependent Kinase 2 (CDK2) Cyclin-dependent kinase 2/cyclin E1
Type:
Protein
Mol. Mass.:
Description:
Components:
This complex has 2 components.
Component 1
Name:
Cyclin-dependent kinase 2
Synonyms:
CDK2 CDK2_HUMAN Cell division protein kinase 2 Protein cereblon/Cyclin-dependent kinase 2 | p33 protein kinase
Type:
Enzyme Subunit
Mol. Mass.:
33938.17
Organism:
Homo sapiens (Human)
Description:
P24941
Residue:
298
  
Component 2
Name:
G1/S-specific cyclin-E1
Synonyms:
CCNE CCNE1_HUMAN
Type:
Enzyme Subunit
Mol. Mass.:
47073.17
Organism:
Homo sapiens (Human)
Description:
Residue:
410
  
Inhibitor
Name:
BDBM50143546
Synonyms:
CHEMBL3760052
Type:
Small organic molecule
Emp. Form.:
C37H57N3O7P2S
Mol. Mass.:
749.877
SMILES:
[H][C@@]12CCc3cc(ccc3[C@@]1(C)CCC[C@@]2(C)C(=O)NC(=S)Nc1cccc(NCC(P(=O)(OCC)OCC)P(=O)(OCC)OCC)c1)C(C)C
: