Target
Carbonic anhydrase 1
Ligand
BDBM16417
Substrate
Meas. Tech.
ChEMBL_1551380 (CHEMBL3762501)
Ki
>10000±n/a nM
Citation
 Carradori, SSecci, DDe Monte, CMollica, ACeruso, MAkdemir, ASobolev, APCodispoti, RDe Cosmi, FGuglielmi, PSupuran, CT A novel library of saccharin and acesulfame derivatives as potent and selective inhibitors of carbonic anhydrase IX and XII isoforms. Bioorg Med Chem 24:1095-105 (2016)  
Target
Name:
Carbonic anhydrase 1
Synonyms:
CA-I CAB Carbonate dehydratase I Carbonic anhydrase 1 (CA I) Carbonic anhydrase 1 (Recombinant CA I) Carbonic anhydrase B Carbonic anhydrase I (CA I) Carbonic anhydrase I (CAI) Carbonic anhydrase isoenzyme I (hCA I) | hCA
Type:
Enzyme
Mol. Mass.:
28873.37
Organism:
Homo sapiens (Human)
Description:
P00915
Residue:
261
  
Inhibitor
Name:
BDBM16417
Synonyms:
(1,3-dioxo-1,3-dihydro-2H-isoindol-2-yl)acetic acid N-Phthaloylglycine | N-Phthalylglycine
Type:
Small organic molecule
Emp. Form.:
C10H7NO4
Mol. Mass.:
205.1669
SMILES:
OC(=O)CN1C(=O)c2ccccc2C1=O
: