Target
5-hydroxytryptamine receptor 2C
Ligand
BDBM50144259
Substrate
Meas. Tech.
ChEMBL_1551502 (CHEMBL3762923)
Ki
>10000±n/a nM
Citation
 Landagaray, EEttaoussi, MDuroux, RBoutin, JACaignard, DHDelagrange, PMelnyk, PBerthelot, PYous, S Melatonergic ligands: Design, synthesis and pharmacological evaluation of novel series of naphthofuranic derivatives. Eur J Med Chem 109:360-70 (2016)  
Target
Name:
5-hydroxytryptamine receptor 2C
Synonyms:
5-HT-1C 5-HT1C 5-HT2C-INI 5-HTR2C 5-hydroxytryptamine receptor 2C (5-HT-2C) 5HT-1C HTR1C Serotonin (5-HT3) receptor Serotonin Receptor 2C
Type:
G Protein-Coupled Receptor (GPCR)
Mol. Mass.:
51836.79
Organism:
Homo sapiens (Human)
Description:
P28335
Residue:
458
  
Inhibitor
Name:
BDBM50144259
Synonyms:
CHEMBL3759054
Type:
Small organic molecule
Emp. Form.:
C18H19NO3
Mol. Mass.:
297.3484
SMILES:
COc1ccc2ccc3occ(CNC(=O)C(C)C)c3c2c1
: