Target
Serine-protein kinase ATM
Ligand
BDBM50208517
Substrate
Meas. Tech.
ChEMBL_1556174 (CHEMBL3768628)
IC50
13±n/a nM
Citation
 Min, JGuo, KSuryadevara, PKZhu, FHolbrook, GChen, YFeau, CYoung, BMLemoff, AConnelly, MCKastan, MBGuy, RK Optimization of a Novel Series of Ataxia-Telangiectasia Mutated Kinase Inhibitors as Potential Radiosensitizing Agents. J Med Chem 59:559-77 (2016)  
Target
Name:
Serine-protein kinase ATM
Synonyms:
A-T mutated ATM_HUMAN | Ataxia telangiectasia mutated
Type:
Protein
Mol. Mass.:
350696.72
Organism:
Homo sapiens (Human)
Description:
Q13315
Residue:
3056
  
Inhibitor
Name:
BDBM50208517
Synonyms:
2-morpholin-4-yl-6-thianthren-1-yl-pyran-4-one KU-55933
Type:
Small organic molecule
Emp. Form.:
C21H17NO3S2
Mol. Mass.:
395.495
SMILES:
O=c1cc(oc(c1)-c1cccc2Sc3ccccc3Sc12)N1CCOCC1
: