Target
Type-2 angiotensin II receptor
Ligand
BDBM50030815
Substrate
Meas. Tech.
ChEMBL_1555129 (CHEMBL3768051)
Ki
0.140000±n/a nM
Citation
 Sallander, JWallinder, CHallberg, AÅqvist, JGutiérrez-de-Terán, H Structural determinants of subtype selectivity and functional activity of angiotensin II receptors. Bioorg Med Chem Lett 26:1355-9 (2016)  
Target
Name:
Type-2 angiotensin II receptor
Synonyms:
AGTR2 AT2 Angiotensin II type 2 (AT-2) receptor Type-2 angiotensin II receptor
Type:
Enzyme Catalytic Domain
Mol. Mass.:
41201.61
Organism:
Homo sapiens (Human)
Description:
Angiotensin II, central 0 0::P50052
Residue:
363
  
Inhibitor
Name:
BDBM50030815
Synonyms:
CHEMBL404594
Type:
Small organic molecule
Emp. Form.:
C46H73N13O10
Mol. Mass.:
968.1529
SMILES:
CC[C@H](C)[C@H](NC(=O)[C@@H]1CCCN1C(=O)[C@H](Cc1c[nH]cn1)NC(=O)[C@@H](NC(=O)[C@H](Cc1ccc(O)cc1)NC(=O)[C@@H](NC(=O)[C@H](CCCN=C(N)N)NC(=O)CNC)C(C)C)[C@@H](C)CC)C(O)=O
: